Patient ID,Age,Gender,Race,Variant ID,Type,Effect,cDNA No. (HGVS),Mutation (cDNA-HGVS),Amino Acid HGVS,Amino Acid Legacy,Protein Change (HGVS),Domain,Location,Other Variants,FXI:C%,FXI:C (IU/dL),FXI:Ag%,FXI:Ag (IU/dL),Inheritance of Primary Variant,Clinical Severity,Comments,Reference
58, , , ,173,Point,Missense,-40,c.-40C>T,0,0, ,Undefined, ,0,89, ,101, ,Heterozygous,Asymptomatic,"Related to pa_id: 56, 57, 59 & 60.",Millar et al 2000
57, ,F, ,173,Point,Missense,-40,c.-40C>T,0,0, ,Undefined, ,0,94, ,96, ,Homozygous,Asymptomatic,"Related to pa_id: 56, 58, 59 & 60.",Millar et al 2000
88,37,M,Iranian,145,Point,Splice site,0,IVS2-3T>G,0,0, ,Splice Site,Intron 2,0, , ,3, ,Homozygous,Severe,"Knee hemarthrosis, hematomas, epistaxis, oral bleeds.",Peyvandi et al 2002
413,5,M,Yemeni,157,Deletion, ,0,Undefined cDNA - deletion (Exons 1-8),0,0, ,Undefined,Exons 1-8,1,1, ,1.8, ,Heterozygous, Not Reported,"Large parietal hematoma, subarachnoid hemorrhage. Related to pa_id: 411, 412, 414 & 415.",Wieland et al 1991
411,27,F,Yemeni,157,Deletion, ,0,Undefined cDNA - deletion (Exons 1-8),0,0, ,Undefined,Exons 1-8,0,53, ,30, ,Heterozygous, Not Reported,"No bleeding history. Related to pa_id: 413, 414 & 415.",Wieland et al 1991
212, , ,German,157,Deletion, ,0,Undefined cDNA - deletion (Exons 1-8),0,0, ,Undefined,Exons 1-8,0,48, , , ,Heterozygous, Not Reported,Combined FX and FVII deficiency. Easy bruising.,Rath et al 2015
210, , ,German,157,Deletion, ,0,Undefined cDNA - deletion (Exons 1-8),0,0, ,Undefined,Exons 1-8,0,51, , , ,Heterozygous, Not Reported,Combined FX and FVII deficiency. Asymptomatic.,Rath et al 2015
404, ,M,African-American,149,Deletion,Frameshift,0,c.1430_1434delATGCC,0,0, ,Serine protease,Exon 8,1, ,72.7, ,65,Heterozygous, Not Reported,Related to pa_id: 402.,Ameri et al 2007
403, ,F,African-American,149,Deletion,Frameshift,0,c.1430_1434delATGCC,0,0, ,Serine protease,Exon 8,1, ,54, ,47,Heterozygous, Not Reported,Related to pa_id: 402.,Ameri et al 2007
402,14,M,African-American,149,Deletion,Frameshift,0,c.1430_1434delATGCC,0,0, ,Serine protease,Exon 8,1, ,<0.2, ,<0.2,Homozygous,Severe,"Post-circumcision bleeding, intra-muscular and -joint bleeds. Related to pa_id: 403 & 404.",Ameri et al 2007
395, ,F, ,141,Deletion, ,0,Undefined cDNA - deletion (Exons7-8),0,0, ,Serine protease,Exons 7-8,0,38, ,35, ,Heterozygous, Not Reported,Related to pa_id: 394.,Bernardi et al 1989
394, ,F, ,141,Deletion, ,0,Undefined cDNA - deletion (Exons7-8),0,0, ,Serine protease,Exons 7-8,0,4, ,7, ,Heterozygous, Not Reported,Paternal mutation not identified in analysis. Related to pa_id: 395 & 396.,Bernardi et al 1989
28, ,F, ,6,Point,Missense,0,Undefined cDNA (A12P) ,12,-29,p.Ala12Pro,Pre-pro leader,Exon 1,0,55.9, ,54.7, ,Heterozygous,Asymptomatic,Asymptomatic. Related to pa_id: 25 & 29.,Liang et al 2013
25,71,M, ,6,Point,Missense,0,Undefined cDNA (A12P) ,12,-29,p.Ala12Pro,Pre-pro leader,Exon 1,1,7.4, ,9.5, ,Heterozygous,Mild,"Scrotal hematoma, hematuria, intramuscular hematoma. Related to pa_id: 28 & 29.",Liang et al 2013
266, ,F, ,154,Deletion, ,0,Undefined cDNA - deletion (Exon 6),0,0, ,Activation peptide,Exon 6,0,56, , , ,Heterozygous, Not Reported,No increased bleeding symptoms. Related to pa_id: 265.,Hainmann et al 2009
265,15 ,F, ,154,Deletion, ,0,Undefined cDNA - deletion (Exon 6),0,0, ,Activation peptide,Exon 6,1,<1, , , ,Heterozygous,Severe,"Microcytic anemia, tooth bleeding, hemarthrosis, hematomas. Related to pa_id: 266.",Hainmann et al 2009
415, ,F,Yemeni,158,Deletion, ,0,Undefined cDNA - deletion (Exons 7-8),0,0, ,Serine protease,Exons 7-8,0,24, ,29, ,Heterozygous, Not Reported,No bleeding history. Assayed in utero. Related to pa_id: 411-414.,Wieland et al 1991
414,3,F,Yemeni,158,Deletion, ,0,Undefined cDNA - deletion (Exons 7-8),0,0, ,Serine protease,Exons 7-8,0,54, ,42, ,Heterozygous, Not Reported,"No bleeding history. Related to pa_id: 411, 412, 413 & 415.",Wieland et al 1991
412,35,M,Yemeni,158,Deletion, ,0,Undefined cDNA - deletion (Exons 7-8),0,0, ,Serine protease,Exons 7-8,0,58, ,39, ,Heterozygous, Not Reported,"No bleeding history. Related to pa_id: 413, 414 & 415.",Wieland et al 1991
409, ,F,Chinese,151,Point,Splice site,0,IVS5+1G>A,0,0, ,Splice Site,Intron 5,0,42.53, ,60.19, ,Heterozygous, Not Reported,No bleeding history. Related to pa_id: 405-408 & 410.,Zhou et al 2013
408, ,F,Chinese,151,Point,Splice site,0,IVS5+1G>A,0,0, ,Splice Site,Intron 5,0,50.77, ,67.34, ,Heterozygous, Not Reported,"No bleeding history. Related to pa_id: 405, 406, 407, 409 & 410.",Zhou et al 2013
407, ,M,Chinese,151,Point,Splice site,0,IVS5+1G>A,0,0, ,Splice Site,Intron 5,1,0.22, ,53.79, ,Heterozygous, Not Reported,"Epistaxis, gum bleeding. Related to pa_id: 405, 406, 408, 409 & 410.",Zhou et al 2013
406, ,M,Chinese,151,Point,Splice site,0,IVS5+1G>A,0,0, ,Splice Site,Intron 5,0,55.96, ,59.45, ,Heterozygous, Not Reported,"No bleeding history. Related to pa_id: 405, 407-410.",Zhou et al 2013
405,36,M,Chinese,151,Point,Splice site,0,IVS5+1G>A,0,0, ,Splice Site,Intron 5,1,0.22, ,53.36, ,Heterozygous,Severe,"Epistaxis, gum bleeding. Related to pa_id: 406-410.",Zhou et al 2013
29, ,F, ,96,Point,Missense,0,Undefined cDNA (F364L) ,364,324,p.Phe364Leu,Serine protease,Exon 8,0,55.5, ,57.1, ,Heterozygous,Asymptomatic,Asymptomatic. Related to pa_id: 25 & 28.,Liang et al 2013
376,76,M, ,142,Point,Splice site,0,IVS1+1G>A,0,0, ,Splice Site,Intron 1,1,15, ,15, ,Heterozygous, Not Reported,"Minor hematuria, epistaxis, postoperative bleeding.",Vanden Hoek et al 2012
286, ,F, ,155,Deletion, ,0,Undefined cDNA - deletion (Exon 1),0,0, ,Pre-pro leader,Exon 1,0, ,40, , ,Heterozygous, Not Reported,Epistaxis gum bleeding. (Combined FX & FVII deficiency). Related to pa_id: 285.,Pavlova et al 2015
285, , , ,155,Deletion, ,0,Undefined cDNA - deletion (Exon 1),0,0, ,Pre-pro leader,Exon 1,0, ,36, , ,Heterozygous, Not Reported,Epistaxis gum bleeding. (Combined FX & FVII deficiency). Related to pa_id: 286.,Pavlova et al 2015
26,37,M, ,69,Point,Missense,0,Undefined cDNA (A275T) ,275,235,p.Ala275Thr,Serine protease,Exon 7,1,6.2, ,36.9, ,Heterozygous,Severe,"Gum bleeds, excessive bleeding following surgery, hemarthrosis.",Liang et al 2013
410, ,F,Chinese,152,Deletion,Inframe,0,Undefined cDNA - deletion (D408del),408,0,p.Asp408del,Serine protease,Exon 8,0,71.73, ,101.41, ,Heterozygous, Not Reported,No bleeding history. Related to pa_id: 405-409.,Zhou et al 2013
200,9,F,Saudi Arabian,30,Point,Missense,0,Undefined cDNA (E91K) ,91,51,p.Glu91Lys,EGF-1,Exon 4,0, ,90, , ,Heterozygous, Not Reported,Related to pa_id: 193-199.,Al-Hilali et al 2007
199,24,F,Saudi Arabian,30,Point,Missense,0,Undefined cDNA (E91K) ,91,51,p.Glu91Lys,EGF-1,Exon 4,0, ,30, , ,Heterozygous, Not Reported,"Related to pa_id: 193-198, & 200.",Al-Hilali et al 2007
198,6,M,Saudi Arabian,30,Point,Missense,0,Undefined cDNA (E91K) ,91,51,p.Glu91Lys,EGF-1,Exon 4,0, , , , ,Heterozygous, Not Reported,"Related to pa_id: 193-197, 199, & 200.",Al-Hilali et al 2007
197,17,M,Saudi Arabian,30,Point,Missense,0,Undefined cDNA (E91K) ,91,51,p.Glu91Lys,EGF-1,Exon 4,0, , , , ,Heterozygous, Not Reported,"Related to pa_id: 193-196, 198, 199, & 200.",Al-Hilali et al 2007
196,36,F,Saudi Arabian,30,Point,Missense,0,Undefined cDNA (E91K) ,91,51,p.Glu91Lys,EGF-1,Exon 4,0, , , , ,-, Not Reported,"Related to pa_id: 193, 194, 195, 197-200.",Al-Hilali et al 2007
195,46,M,Saudi Arabian,30,Point,Missense,0,Undefined cDNA (E91K) ,91,51,p.Glu91Lys,EGF-1,Exon 4,0, ,5, , ,Homozygous, Not Reported,"Related to pa_id: 193, 194, 196-200.",Al-Hilali et al 2007
194, ,M,Saudi Arabian,30,Point,Missense,0,Undefined cDNA (E91K) ,91,51,p.Glu91Lys,EGF-1,Exon 4,0, , , , ,Heterozygous, Not Reported,Related to pa_id: 195-200.,Al-Hilali et al 2007
193,77,F,Saudi Arabian,30,Point,Missense,0,Undefined cDNA (E91K) ,91,51,p.Glu91Lys,EGF-1,Exon 4,0, , , , ,Heterozygous, Not Reported,Related to pa_id: 195-200.,Al-Hilali et al 2007
192,10,F,Saudi Arabian,30,Point,Missense,0,Undefined cDNA (E91K) ,91,51,p.Glu91Lys,EGF-1,Exon 4,0, ,67, , ,Heterozygous, Not Reported,Related to pa_id: 186-191.,Al-Hilali et al 2007
191,12,F,Saudi Arabian,30,Point,Missense,0,Undefined cDNA (E91K) ,91,51,p.Glu91Lys,EGF-1,Exon 4,0, ,46, , ,Heterozygous, Not Reported,Related to pa_id: 186-190 & 192.,Al-Hilali et al 2007
190,15,M,Saudi Arabian,30,Point,Missense,0,Undefined cDNA (E91K) ,91,51,p.Glu91Lys,EGF-1,Exon 4,0, ,46, , ,Heterozygous, Not Reported,"Related to pa_id: 186-189, 191 & 192.",Al-Hilali et al 2007
189,21,F,Saudi Arabian,30,Point,Missense,0,Undefined cDNA (E91K) ,91,51,p.Glu91Lys,EGF-1,Exon 4,0, ,49, , ,Heterozygous, Not Reported,"Related to pa_id: 186, 187, 188, 190, 191 & 192.",Al-Hilali et al 2007
188,24,F,Saudi Arabian,30,Point,Missense,0,Undefined cDNA (E91K) ,91,51,p.Glu91Lys,EGF-1,Exon 4,0, ,40, , ,Heterozygous, Not Reported,"Related to pa_id: 186, 187, 189-192.",Al-Hilali et al 2007
187,7,F,Saudi Arabian,30,Point,Missense,0,Undefined cDNA (E91K) ,91,51,p.Glu91Lys,EGF-1,Exon 4,0, ,45, , ,Heterozygous, Not Reported,"Related to pa_id: 186, 188-192.",Al-Hilali et al 2007
186,64,M,Saudi Arabian,30,Point,Missense,0,Undefined cDNA (E91K) ,91,51,p.Glu91Lys,EGF-1,Exon 4,0, ,4, , ,Homozygous, Not Reported,Related to pa_id: 187-192.,Al-Hilali et al 2007
75,8,M,Iranian,144,Point,Splice site,0,IVS1+3A>T,0,0, ,Splice Site,Intron 1,0, , ,7, ,Homozygous,Severe, ,Peyvandi et al 2002
289, , , ,156,Deletion, ,0,Undefined cDNA - deletion (Exons 1-6),0,0, ,Undefined,Exons 1-6,1, ,2, , ,Heterozygous, Not Reported,"Epistaxis gum bleeding, severe postoperative bleeding. (Combined FX & FVII deficiency).",Pavlova et al 2015
211, , ,Caucasian,156,Deletion, ,0,Undefined cDNA - deletion (Exons 1-6),0,0, ,Undefined,Exons 1-6,1,<1, , , ,Heterozygous, Not Reported,Combined FX and FVII deficiency. Severe periumbilical bleeding and cutaneous post-natal bruises.,Rath et al 2015
27,10 ,M, ,46,Point,Missense,0,Undefined cDNA (C151R),151,111,p.Cys151Arg,EGF-2,Exon 5,1,3.2, ,5.5, ,Heterozygous,Severe,Right frontal subdural hematoma.,Liang et al 2013
401, ,F,Japanese,148,Deletion,Inframe,0,Undefined cDNA - deletion (Intron 4) ,0,0, ,Intronic Region,Intron 4,0,69, , , ,Heterozygous, Not Reported,Related to pa_id: 399 & 400.,Hayashi et al 1998
400, ,F,Japanese,148,Deletion,Inframe,0,Undefined cDNA - deletion (Intron 4) ,0,0, ,Intronic Region,Intron 4,0,50, , , ,Heterozygous, Not Reported,Related to pa_id: 399 & 401.,Hayashi et al 1998
399,56,F,Japanese,148,Deletion,Inframe,0,Undefined cDNA - deletion (Intron 4) ,0,0, ,Intronic Region,Intron 4,0,2.5, ,<5, ,Homozygous, Not Reported,"Frequent subcutaneous hemorrhage, epistaxis, hypermenorrhea, prolonged bleeding after labour and tooth extraction. Related to pa_id: 400 & 401.",Hayashi et al 1998
2, ,M, ,1,Point,Missense,1,c.1A>G,1,-40,p.Met1Val,Pre-pro leader,Exon 1,0,44, ,48, ,Heterozygous, Not Reported,Related to pa_id: 1.,Miyata et al 1998
149,11,F,British,1,Point,Missense,1,c.1A>G,1,-40,p.Met1Val,Pre-pro leader,Exon 1,0, ,<1, , ,Homozygous,Severe,History of severe bleeding.,Mitchell et al 2019
1,12,F, ,1,Point,Missense,1,c.1A>G,1,-40,p.Met1Val,Pre-pro leader,Exon 1,2,4, ,7, ,Heterozygous,Asymptomatic,No history of bleeding. Related to pa_id: 2 & 3.,Miyata et al 1998
19,10,F,Indian,3,Point,Missense,22,c.22G>T,8,-33,p.Val8Phe,Pre-pro leader,Exon 1,2,<1, , , ,Heterozygous,Severe,"Hemarthrosis, spontaneous bleeds.",Mota et al 2010
17,40,F,Indian,3,Point,Missense,22,c.22G>T,8,-33,p.Val8Phe,Pre-pro leader,Exon 1,0,<1, ,6, ,Heterozygous,Severe,"Menorrhagia, bad obstetric history.",Mota et al 2010
23, ,M,Chinese,5,Point,Missense,33,c.33T>G,11,-30,p.Ser11Arg,Pre-pro leader,Exon 1,0,69.8, ,72, ,Heterozygous,Asymptomatic,"Asymptomatic. Related to pa_id: 20, 21 & 22.",Wang et al 2005
22, ,M,Chinese,5,Point,Missense,33,c.33T>G,11,-30,p.Ser11Arg,Pre-pro leader,Exon 1,0,71.2, ,75.8, ,Heterozygous,Asymptomatic,"Asymptomatic. Related to pa_id: 20, 21 & 23.",Wang et al 2005
21, ,F,Chinese,5,Point,Missense,33,c.33T>G,11,-30,p.Ser11Arg,Pre-pro leader,Exon 1,0,49.9, ,53.4, ,Heterozygous,Asymptomatic,"Asymptomatic. Related to pa_id 20, 22 & 23.",Wang et al 2005
20,52,M,Chinese,5,Point,Missense,33,c.33T>G,11,-30,p.Ser11Arg,Pre-pro leader,Exon 1,0,2.6, ,8.2, ,Homozygous,Severe,"Bleeding after trauma. Related to pa_id: 21,22 & 23.",Wang et al 2005
8,7,M,Indian,7,Point,Missense,44,c.44C>A,15,-26,p.Ala15Asp,Pre-pro leader,Exon 1,1,<1, ,<1, ,Homozygous,Severe,Hemarthrosis.,Mota et al 2010
7,12,M,Indian,7,Point,Missense,44,c.44C>A,15,-26,p.Ala15Asp,Pre-pro leader,Exon 1,1,<1, ,<1, ,Homozygous,Severe,Hemarthrosis.,Mota et al 2010
30,4,F,Pakistani,7,Point,Missense,44,c.44C>A,15,-26,p.Ala15Asp,Pre-pro leader,Exon 1,0,<2, , , ,Homozygous,Severe,"Umbilical cord bleed, hemarthrosis.",Borhany et al 2018
10,9,F,Indian,7,Point,Missense,44,c.44C>A,15,-26,p.Ala15Asp,Pre-pro leader,Exon 1,1,<1, ,<1, ,Heterozygous,Mild,"Echymosis, gum bleeds.",Mota et al 2010
90,23,F,Iranian,8,Point,Missense,61,c.61G>A,21,-20,p.Gly21Arg,Pre-pro leader,Exon 1,0,0.7, , , ,-,Severe,"Menorrhagia, hemarthrosis, hematoma.",Karimi et al 2012
74, ,F,Dominican,8,Point,Missense,61,c.61G>A,21,-20,p.Gly21Arg,Pre-pro leader,Exon 1,0,29, ,50, ,Heterozygous,Asymptomatic,Asymptomatic. Related to pa_id: 72.,Watzke et al 1991
73, ,M,Dominican,8,Point,Missense,61,c.61G>A,21,-20,p.Gly21Arg,Pre-pro leader,Exon 1,0,38, ,50, ,Heterozygous,Asymptomatic,Asymptomatic. Related to pa_id: 72.,Watzke et al 1991
72,16,F,Dominican,8,Point,Missense,61,c.61G>A,21,-20,p.Gly21Arg,Pre-pro leader,Exon 1,0,<1, ,5, ,Homozygous,Severe,Heavy menstrual bleeding. Related to pa_id: 73 & 74.,Watzke et al 1991
69, , , ,8,Point,Missense,61,c.61G>A,21,-20,p.Gly21Arg,Pre-pro leader,Exon 1,0,1, , , ,Homozygous, Not Reported,Related to pa_id: 67 & 68.,Millar et al 2000
68, , , ,8,Point,Missense,61,c.61G>A,21,-20,p.Gly21Arg,Pre-pro leader,Exon 1,0,1, , , ,Homozygous, Not Reported,Related to pa_id: 67 & 69.,Millar et al 2000
67, , , ,8,Point,Missense,61,c.61G>A,21,-20,p.Gly21Arg,Pre-pro leader,Exon 1,0,2, ,3, ,Homozygous, Not Reported,Significant hemorrhagic symptoms. Related to pa_id: 68 & 69.,Millar et al 2000
427,38,M,Spanish,8,Point,Missense,61,c.61G>A,21,-20,p.Gly21Arg,Pre-pro leader,Exon 1,0,1,, , ,Homozygous,Moderate,Cardiac tamponade. Dyspnea on exertion and orthopnea. Epistaxis. Prolonged bleeding following appendectomy.,Othman et al 2019
161, ,F,Iranian,8,Point,Missense,61,c.61G>A,21,-20,p.Gly21Arg,Pre-pro leader,Exon 1,0,42, ,36, ,Heterozygous, Not Reported,Asymptomatic. Related to pa_id: 160.,Karimi et al 2008
160, ,F,Iranian,8,Point,Missense,61,c.61G>A,21,-20,p.Gly21Arg,Pre-pro leader,Exon 1,0,<1, ,<1, ,Homozygous,Severe,"Gum bleeding, epistaxis, ecchymoses, menorrhagia. Related to pa_id: 161.",Karimi et al 2008
159, ,M,Iranian,8,Point,Missense,61,c.61G>A,21,-20,p.Gly21Arg,Pre-pro leader,Exon 1,0,64, ,48, ,Heterozygous,Asymptomatic,"Asymptomatic. Related to pa_id: 154, 155 & 156.",Karimi et al 2008
158, ,F,Iranian,8,Point,Missense,61,c.61G>A,21,-20,p.Gly21Arg,Pre-pro leader,Exon 1,0,46, ,44, ,Heterozygous, Not Reported,"Post dental extraction bleeding. Related to pa_id: 154, 155 & 156.",Karimi et al 2008
157, ,M,Iranian,8,Point,Missense,61,c.61G>A,21,-20,p.Gly21Arg,Pre-pro leader,Exon 1,0,<1, ,2, ,Homozygous,Severe,"Epistaxis, hematuria, hemarthroses, bleeding post dental extraction and cicumcision. Related to pa_id: 154, 155, 156, 158 & 159.",Karimi et al 2008
156, ,M,Iranian,8,Point,Missense,61,c.61G>A,21,-20,p.Gly21Arg,Pre-pro leader,Exon 1,0,23, ,43, ,Heterozygous, Not Reported,"Gum bleeding, epistaxis, post-trauma hemarthroses, hematomas, bleeding post dental extraction and circumcision. Related to pa_id: 154, 155, 157, 158 & 159.",Karimi et al 2008
155, ,F,Iranian,8,Point,Missense,61,c.61G>A,21,-20,p.Gly21Arg,Pre-pro leader,Exon 1,0,<1, ,5, ,Homozygous,Severe,"Gum bleeding, hemarthroses, hematomas. Related to pa_id: 154, 156-159.",Karimi et al 2008
154, , ,Iranian,8,Point,Missense,61,c.61G>A,21,-20,p.Gly21Arg,Pre-pro leader,Exon 1,0,<1, ,4, ,Homozygous,Severe,"Gum bleeding, hemarthroses, hematomas. Related to pa_id: 155-159.",Karimi et al 2008
138,14,F,German,8,Point,Missense,61,c.61G>A,21,-20,p.Gly21Arg,Pre-pro leader,Exon 1,0, ,3, ,8,Homozygous,Moderate,Spontaneous/ hemorrhagic bleeding.,Mitchell et al 2019
130,40,F,American,8,Point,Missense,61,c.61G>A,21,-20,p.Gly21Arg,Pre-pro leader,Exon 1,0, ,<1, ,3,Homozygous,Severe,Spontaneous/ hemorrhagic bleeding.,Mitchell et al 2019
13,25,M,Indian,8,Point,Missense,61,c.61G>A,21,-20,p.Gly21Arg,Pre-pro leader,Exon 1,0,<1, , , ,Homozygous,Severe,"Hemetemesis, CNS bleed, hemarthrosis.",Mota et al 2010
128,58,F,Spanish,8,Point,Missense,61,c.61G>A,21,-20,p.Gly21Arg,Pre-pro leader,Exon 1,0, ,<1, ,5,Homozygous,Severe,Spontaneous/ hemorrhagic bleeding.,Mitchell et al 2019
127,22,M,Spanish,8,Point,Missense,61,c.61G>A,21,-20,p.Gly21Arg,Pre-pro leader,Exon 1,1, ,<1, ,1,Heterozygous,Severe,Spontaneous/ hemorrhagic bleeding.,Mitchell et al 2019
146,3,M,British,169,Point,Splice site,70,c.70+2T>G,0,0, ,Splice Site, ,1, ,<1, , ,Heterozygous,Severe,History of severe bleeding.,Mitchell et al 2019
129,20,M,Spanish,170,Point,Splice site,70,c.70+4A>G,0,0, ,Splice Site, ,1, ,<1, ,15,Heterozygous,Severe,Spontaneous/ hemorrhagic bleeding.,Mitchell et al 2019
55, , , ,9,Point,Missense,116,c.116C>T,39,-2,p.Thr39Met,Pre-pro leader,Exon 2,2,12, ,26, ,Heterozygous,Asymptomatic,Asymptomatic.,Millar et al 2000
96,11,F,Iranian,10,Point,Missense,119,c.119G>C,40,-1,p.Arg40Thr,Pre-pro leader,Exon 2,0,0.7, , , ,-,Severe,"Epistaxis, hematuria, gum bleeding, intracranial hemorrhage.",Karimi et al 2012
95,6,F,Iranian,10,Point,Missense,119,c.119G>C,40,-1,p.Arg40Thr,Pre-pro leader,Exon 2,0,0.8, , , ,-,Severe,"Epistaxis, gum bleeding.",Karimi et al 2012
79,5,F,Iranian,10,Point,Missense,119,c.119G>C,40,-1,p.Arg40Thr,Pre-pro leader,Exon 2,0,7, ,57, ,Homozygous,Severe,"Hemarthrosis, hematomas, umbilical cord bleeding.",Peyvandi et al 2002
78,28,M,Iranian,10,Point,Missense,119,c.119G>C,40,-1,p.Arg40Thr,Pre-pro leader,Exon 2,0,3, ,59, ,Homozygous,Severe,"Hemarthrosis, hematomas, umbilical cord bleeding.",Peyvandi et al 2002
77,7,F,Iranian,10,Point,Missense,119,c.119G>C,40,-1,p.Arg40Thr,Pre-pro leader,Exon 2,0,<1, ,43, ,Homozygous,Severe,"Hemarthrosis, hematomas, umbilical cord bleeding. Related to pa_id: 76.",Peyvandi et al 2002
76,22,F,Iranian,10,Point,Missense,119,c.119G>C,40,-1,p.Arg40Thr,Pre-pro leader,Exon 2,0,<1, ,66, ,Homozygous,Severe,"Hemarthrosis, hematomas, umbilical cord bleeding. Related to pa_id: 77.",Peyvandi et al 2002
103, ,F,Iranian,11,Point,Missense,128,c.128C>G,43,3,p.Ser43Cys,Gla domain,Exon 2,0,56, ,67, ,Heterozygous, Not Reported,Related to pa_id: 100 & 101.,Menegatti et al 2004
102, ,M,Iranian,11,Point,Missense,128,c.128C>G,43,3,p.Ser43Cys,Gla domain,Exon 2,0,75, ,83, ,Heterozygous, Not Reported,Related to pa_id: 100 & 101.,Menegatti et al 2004
101,24,F,Iranian,11,Point,Missense,128,c.128C>G,43,3,p.Ser43Cys,Gla domain,Exon 2,0,19, ,54, ,Homozygous, Not Reported,"Severe bleeding symptoms (epistaxis and menorrhagia). Mild FX deficiency and severe FVII deficiency. Related to pa_id: 100, 102 & 103.",Menegatti et al 2004
100,38,M,Iranian,11,Point,Missense,128,c.128C>G,43,3,p.Ser43Cys,Gla domain,Exon 2,0,10, ,42, ,Homozygous, Not Reported,"Severe bleeding symptoms  (muscle hematomas, gastrointestinal hemorrhages). Mild FX deficiency and severe FVII deficiency. Related to pa_id:101, 102 &103.",Menegatti et al 2004
353, ,F, ,13,Point,Missense,140,c.140A>G,47,7,p.Glu47Gly,Gla domain,Exon 2,0, ,50, ,50,Heterozygous,Asymptomatic,No history of bleeding. Related to pa_id: 352.,Deam et al 2004
97,20,M,Iranian,15,Point,Missense,151,c.151G>A,51,11,p.Gly51Arg,Gla domain,Exon 2,0,0.8, , , ,-,Severe,"Hemarthrosis, gum bleeding, intracranial hemorrhage.",Karimi et al 2012
106, ,M, ,14,Point,Missense,152,c.152G>T,51,11,p.Gly51Val,Gla domain,Exon 2,0,57, , , ,Heterozygous,Asymptomatic,Asymptomatic. Related to pa_id: 104.,Chafa et al 2009
105, ,F, ,14,Point,Missense,152,c.152G>T,51,11,p.Gly51Val,Gla domain,Exon 2,0,66, ,85, ,Heterozygous,Asymptomatic,Asymptomatic. Related to pa_id: 104.,Chafa et al 2009
104,10,F, ,14,Point,Missense,152,c.152G>T,51,11,p.Gly51Val,Gla domain,Exon 2,0,<1, ,75, ,Homozygous,Severe,"Umbilical cord bleeding, possible undiagnosed cerebral hemorrhage (paraplegia), epistaxis, bleeding upon tooth loss. Related to pa_id: 105 & 106.",Chafa et al 2009
54, , , ,16,Point,Missense,160,c.160G>A,54,14,p.Glu54Lys,Gla domain,Exon 2,0,2, , , ,Homozygous,Asymptomatic,"Related to pa_id: 50, 51, 52 & 53.",Millar et al 2000
53, , , ,16,Point,Missense,160,c.160G>A,54,14,p.Glu54Lys,Gla domain,Exon 2,0,0.7, ,37, ,Homozygous,Asymptomatic,"Related to pa_id: 50, 51, 52 & 54.",Millar et al 2000
52, , , ,16,Point,Missense,160,c.160G>A,54,14,p.Glu54Lys,Gla domain,Exon 2,0,35, ,42, ,Heterozygous,Asymptomatic,"Related to pa_id: 50, 51, 53 & 54.",Millar et al 2000
51, ,M, ,16,Point,Missense,160,c.160G>A,54,14,p.Glu54Lys,Gla domain,Exon 2,0,42, ,62, ,Heterozygous,Asymptomatic,"Related to pa_id: 50, 52, 53 & 54.",Millar et al 2000
50, , , ,16,Point,Missense,160,c.160G>A,54,14,p.Glu54Lys,Gla domain,Exon 2,0,0.8, ,40, ,Homozygous,Asymptomatic,"Asymptomatic. Related to pa_id: 51, 52, 53 & 54.",Millar et al 2000
117, ,F,African,16,Point,Missense,160,c.160G>A,54,14,p.Glu54Lys,Gla domain,Exon 2,0, , , , ,-, Not Reported,Heavy blood loss at menarche. Related to pa_id: 115 & 116.,Van Dievoet et al 2019
116, ,F,African,16,Point,Missense,160,c.160G>A,54,14,p.Glu54Lys,Gla domain,Exon 2,0, , , , ,-,Asymptomatic,No bleeding history. Related to pa_id: 115 & 117.,Van Dievoet et al 2019
115,28,F,African,16,Point,Missense,160,c.160G>A,54,14,p.Glu54Lys,Gla domain,Exon 2,0, , , , ,Homozygous, Not Reported,No  bleeding history (but minor gum bleeding and vaginal bleeding during late stages of pregancy). Related to pa_id: 116 & 117.,Van Dievoet et al 2019
114, ,F,Austrian,16,Point,Missense,160,c.160G>A,54,14,p.Glu54Lys,Gla domain,Exon 2,1, , , , ,Heterozygous, Not Reported,Related to pa_id: 107-113.,Watzke et al 1990
113, ,F,Austrian,16,Point,Missense,160,c.160G>A,54,14,p.Glu54Lys,Gla domain,Exon 2,1, , , , ,Heterozygous, Not Reported,Related to pa_id: 107-112 & 114.,Watzke et al 1990
112, ,F,Austrian,16,Point,Missense,160,c.160G>A,54,14,p.Glu54Lys,Gla domain,Exon 2,1, , , , ,Heterozygous, Not Reported,"Related to pa_id: 107-111, 113 & 114.",Watzke et al 1990
111, ,M,Austrian,16,Point,Missense,160,c.160G>A,54,14,p.Glu54Lys,Gla domain,Exon 2,1, , , , ,Heterozygous, Not Reported,"Related to pa_id: 107-110, 112, 113 & 114.",Watzke et al 1990
110, ,M,Austrian,16,Point,Missense,160,c.160G>A,54,14,p.Glu54Lys,Gla domain,Exon 2,1, , , , ,Heterozygous, Not Reported,"Related to pa_id: 107, 108, 109, 111-114.",Watzke et al 1990
109, ,F,Austrian,16,Point,Missense,160,c.160G>A,54,14,p.Glu54Lys,Gla domain,Exon 2,1, , , , ,Homozygous, Not Reported,"Related to pa_id: 107, 108, 110-114.",Watzke et al 1990
108, ,M,Austrian,16,Point,Missense,160,c.160G>A,54,14,p.Glu54Lys,Gla domain,Exon 2,1, , , , ,Homozygous, Not Reported,"Related to pa_id: 107, 109-114.",Watzke et al 1990
107, ,M,Austrian,16,Point,Missense,160,c.160G>A,54,14,p.Glu54Lys,Gla domain,Exon 2,1, , , , ,Homozygous, Not Reported,Mild bruising but no apparent bleeding tendency. Related to pa_id:  108-114.,Watzke et al 1990
118, ,M, ,17,Point,Missense,161,c.161A>G,54,14,p.Glu54Gly,Gla domain,Exon 2,0,5, ,20, ,Homozygous,Mild,Life-long bleeding tendency.,"Kim, Thompson & James 1995"
418, ,M,Caucasian,159,Deletion,Frameshift,162,c.162_165delAAGA,0,0,p.Glu54GlufsX59,Gla domain,Exon 2,0, ,73, , ,Heterozygous, Not Reported,No bleeding history. Related to pa_id: 416.,Tan et al 2012